{"text_format":"1","workbook":"xlsx","n_sheets":7,"sheets":["Monthly Report","Fare Calculator","Instructions","FAQ and Forms","Admin","RTM","Fare Schedule"],"not_rendered":{"charts":0,"images":1,"macros":1,"external_links":0,"defined_names":7,"comments":1,"pivot_tables":0},"unopened":[],"bounds":{"document_bytes":16777216,"sheet_cells":100000,"rows_first":2000,"rows_last":500,"rows_between":2000,"halvings":0,"cell_chars":16384,"cell_head_chars":4096},"cells_cut":0,"cells_raw":0,"read":"whole","date_system":"1900"}

{"sheet":"Monthly Report","index":0,"n_rows":59,"n_cols":20,"rows_kept":59,"cut":false,"hidden":false,"merged":[[0,4,1,14],[6,2,7,5],[52,1,57,3],[8,2,9,2],[16,2,17,2],[8,4,9,5],[16,4,17,5],[10,2,11,2],[12,2,13,2],[14,2,15,2],[10,4,11,5],[12,4,13,5],[14,4,15,5],[48,2,51,7],[52,4,53,7],[54,4,57,7],[57,11,57,13],[50,17,50,18],[52,11,52,13],[53,11,53,13],[54,11,54,13],[48,8,48,9],[49,11,51,16],[52,14,57,20],[13,18,13,19],[12,16,12,17],[14,12,14,13],[24,8,24,11],[24,12,24,13],[12,12,12,13],[12,18,12,19],[20,1,21,10],[18,9,18,11],[23,8,23,14],[52,8,57,10],[55,11,55,13],[56,11,56,13],[5,9,5,11],[7,16,7,17],[8,16,8,17],[7,14,7,15],[8,14,8,15],[8,12,8,13],[7,12,7,13],[7,9,7,10],[5,12,5,17],[11,16,11,17],[11,18,11,19],[10,12,10,13],[9,12,9,13],[24,15,24,19],[32,2,32,7],[25,4,25,5],[26,4,26,5],[27,4,27,5],[24,4,24,5],[46,5,47,5],[3,7,18,7],[20,11,21,11],[22,2,22,5],[22,8,22,10],[3,1,4,6],[46,4,47,4],[23,2,23,5],[12,9,12,10],[46,2,47,3],[45,1,45,2],[30,2,31,5],[40,2,41,2],[40,5,41,5],[3,8,4,13],[40,4,41,4],[0,18,0,20],[1,19,1,20],[20,19,20,20],[9,14,9,19],[14,14,14,19],[13,16,13,17],[10,18,10,19],[10,14,10,15],[11,14,11,15],[12,14,12,15],[15,12,17,19],[11,12,11,13],[6,12,6,18],[7,18,7,19],[8,18,8,19],[10,16,10,17]]}
[null,null,null,null,"Monthly Vanpool/Vanshare Report",null,null,null,null,null,null,null,null,null,null,null,null,null,{"$f":"E9","v":"August 2023"}]
[null,null,null,null,null,null,null,null,null,null,null,null,null,null,null,null,null,null,null,{"$f":"\"GIN \"&E11&\"\"","v":"GIN "}]
[]
[null,null,null,null,null,null,null,null,{"$f":"VLOOKUP(E9,Admin!$A$1:$C$34,3,FALSE)","v":"July 2023 Trip Information and Mileage"}]
[]
[null,null,"Revenue Month",null,null,null,null,null,null,"Trip Information",null,null,"Van Mileage"]
[null,null,"Select current revenue month and enter your group ID, van number, and bookkeeper name.",null,null,null,null,null,null,"Enter last month's RTM, days traveled and any itemized miles.",null,null,"Enter last month's odometer readings for your primary van and any loaner vehicles."]
[null,null,null,null,null,null,null,null,null,{"$f":"VLOOKUP(E9,Admin!$A$2:$C$34,2,FALSE)","v":"July 2023"},null,null,"Primary Van #",null,"Ending Mileage",null,"Beginning Mileage",null,"Miles"]
[null,null,"Select Revenue Month",null,"August 2023",null,null,null,null,"RTM (Round Trip Miles)","<select>",null,{"$f":"E13","v":0},null,null,null,null,null,{"$f":"O9-Q9","v":0}]
[null,null,null,null,null,null,null,null,null,"Days Traveled","<select>",null,"Loaner Van #",null,{"$f":"IF(AND(ISNUMBER(S9),S9<0),\"ERROR Negative Miles. Check Mileage Readings\",\"\")","v":""}]
[null,null,"Group ID:",null,null,null,null,null,null,"Total Allowed Miles",{"$f":"IFERROR(K9*K10,0)","v":0},null,null,null,null,null,null,null,{"$f":"(O11-Q11)","v":0}]
[null,null,null,null,null,null,null,null,null,"Total Miles Traveled",{"$f":"S14","v":0},null,null,null,null,null,null,null,{"$f":"(O12-Q12)","v":0}]
[null,null,"Van Number:",null,null,null,null,null,null,"Itemized Miles",null,null,null,null,null,null,null,null,{"$f":"O13-Q13","v":0}]
[null,null,null,null,null,null,null,null,null,"Maintenance Shuttle",0,null,null,null,null,null,"Total Miles:",null,{"$f":"SUM(S9,S11,S12,S13)","v":0}]
[null,null,"Bookkeeper Name:",null,null,null,null,null,null,"Driver Training",0,null,"Comment Box",null,{"$f":"IF((OR(S11<0,S12<0,S13<0)), \"ERROR Negative Miles. Check Mileage Readings.\",\"\")","v":""}]
[null,null,null,null,null,null,null,null,null,"Other",0]
[null,null,"Due Date:",null,{"$f":"VLOOKUP(E9,Admin!$A$1:$G$34,7,FALSE)","v":"August 10th, 2023"},null,null,null,null,"Driver Bonus Miles",40]
[null,null,null,null,null,null,null,null,null,"Unused/Excess Miles",{"$f":"K12-K11-K14-K15-K16-K17","v":-40}]
[null,null,null,null,null,null,null,null,null,"Miles driven over the allowed limit are charged at 60 cents per mile."]
[]
[null,{"$f":"VLOOKUP(E9,Admin!$A$2:$D$34,4,FALSE)","v":"Revenue and Ridership for August 2023"},null,null,null,null,null,null,null,null,null,null,null,null,null,null,null,null,null,{"$f":"\"GIN \"&E11&\"\"","v":"GIN "}]
[]
[null,null,{"$f":"VLOOKUP(E9,Table1[#All],5,FALSE)","v":"Fixed Rate for August"},null,null,null,null,null,{"$f":"VLOOKUP(E9,Admin!$A$1:$J$34,10,FALSE)","v":"Rider Roster for August"}]
[null,null,"Select the RTM, schedule, and van size for the current month to get your group's Fixed Rate. Notify your Accounting Rep of any updates.",null,null,null,null,null,{"$f":" \"Enter current active riders below and indicate their monthly fare and payment type.  \nFares are paid for the current month.\"","v":"Enter current active riders below and indicate their monthly fare and payment type.  \nFares are paid for the current month."}]
[null,null,"RTM (Round Trip Miles)",null,"<select>",null,null,null,"Rider Information",null,null,null,"Enter rider's start or end date",null,"Fare","Payment Type"]
[null,null,"Work Schedule",null,"<select>",null,null,null,"Part-","Rider Name",null,"ORCA Card","New","Leaving","Monthly","ORCA","Monthly",null,"Online","Personal"]
[null,null,"Van Size",null,"<select>",null,null,null,"Time","(Last Name, First Name)","Employer","Number","Rider","Rider","Fare","Passport /","Vanpool","Voucher","Payment","Check"]
[null,null,"Fixed Rate",null,{"$f":"IFERROR(INDEX('Fare Schedule'!A2:D716,MATCH(1,('Fare Schedule'!A2:A716='Monthly Report'!E25)*('Fare Schedule'!B2:B716='Monthly Report'!E26)*('Fare Schedule'!C2:C716='Monthly Report'!E27),0),4),0)","v":0},null,null,null,"Part-Time","Riders","Employer","OrcaNumber","New Rider","Leaving Rider","Monthly Fare","UPASS","Pass","Voucher","Online Pymt","Personal Ck"]
[]
[]
[null,null,{"$f":"VLOOKUP(E9,Table1[#All],6,FALSE)","v":"Revenue for August"}]
[]
[null,null,"Enter the fixed rate and any late fees, bank charges or "]
[null,null,"adjustments.",null,null,"Office Use"]
[null,null,"Fixed Rate:",null,{"$f":"E28","v":0}]
[null,null,"Vanpool Pass:",null,{"$f":"Q49","v":0}]
[null,null,"Vouchers:",null,{"$f":"R49","v":0}]
[null,null,"+ Excess Mile Charges:",null,{"$f":"MAX(K18*0.6,0)","v":0}]
[null,null,"+ Late Fee:"]
[null,null,"- Bank Charge:"]
{"$rows_left_out":20}
{"sheet":"Fare Calculator","index":1,"n_rows":21,"n_cols":6,"rows_kept":21,"cut":false,"hidden":false,"merged":[[20,1,20,7],[3,3,5,5],[2,3,2,5],[13,3,17,5]]}
[]
[]
[null,null,null,"Fare Calculator"]
[null,null,null,"Enter the number of full-time and part-time riders, and the vanpool's fixed rate to calculate rider fares."]
[]
[]
[null,null,null,"Number of Full-Time riders"]
[null,null,null,"Number of Part-Time riders"]
[null,null,null,"Vanpool Fixed Rate"]
[]
[null,null,null,"Full-Time Rider Fare:",null,{"$f":"IF(F7=0,0,(F9/((F7+0.5*F8))))","v":0}]
[null,null,null,"Part-Time Rider Fare:",null,{"$f":"IF(F8=0,0,(F11/2))","v":0}]
[]
[null,null,null,"Enter these fare amounts on your report, in section 5 (Rider Roster) under Monthly Fare (column O).\n\nYou may need to adjust a rider's fare by a few cents in order to balance."]
[]
[]
[]
[]
[]
[]
[null,"This is your worksheet. Do not send a paper copy with your report."]

{"sheet":"Instructions","index":2,"n_rows":13,"n_cols":6,"rows_kept":13,"cut":false,"hidden":false,"merged":[[7,5,7,13],[2,4,3,13],[5,4,5,13],[6,5,6,13]]}
[]
[]
[null,null,null,null,"Instructions"]
[]
[]
[null,null,null,null,"* Enable macros for best functionality."]
[null,null,null,null,null,"Select the current revenue month. Enter your group ID, van number, and name."]
[null,null,null,null,null,"Enter last month's trip information."]
[null,null,null,null,null,"Enter last month's mileage from each van."]
[null,null,null,null,null,"Enter the current month's fare information."]
[null,null,null,null,null,"Enter current ridership, each rider's fare, and their payment method."]
[null,null,null,null,null,"Enter the fixed rate, and any adjustments such as late fees or bank charges."]
[null,null,null,null,null,"Make payment and send the report to your Accounting Rep by the 10th."]

{"sheet":"FAQ and Forms","index":3,"n_rows":12,"n_cols":20,"rows_kept":12,"cut":false,"hidden":false,"merged":[[1,1,1,16]]}
[]
[null,"Bookkeeping FAQ",null,null,null,null,null,null,null,null,null,null,null,null,null,null,null,null,null,"Forms"]
[]
[null,null,null,null,null,null,null,null,null,null,null,null,null,null,null,null,null,null,null,"Participant Application (Docusign)"]
[]
[null,null,null,null,null,null,null,null,null,null,null,null,null,null,null,null,null,null,null,"ORCA Business Passport Use Form"]
[]
[null,null,null,null,null,null,null,null,null,null,null,null,null,null,null,null,null,null,null,"Reimbursement Form"]
[]
[null,null,null,null,null,null,null,null,null,null,null,null,null,null,null,null,null,null,null,"Courtesy Cab Form"]
[]
[null,null,null,null,null,null,null,null,null,null,null,null,null,null,null,null,null,null,null,"Link to other vanpool resources"]

{"sheet":"Admin","index":4,"n_rows":34,"n_cols":11,"rows_kept":34,"cut":false,"hidden":true,"merged":[]}
["Month","Column1","Column2","Column3","Column4","Column5","Column6","Column7","Column8","Column9","Days in week"]
["May 2023","April 2023","April 2023 Trip Information and Mileage","Revenue and Ridership for May 2023","Fixed Rate for May","Revenue for May","May 10th, 2023","Trip Information for April","Van Mileage for April","Rider Roster for May","<select>"]
["June 2023","May 2023","May 2023 Trip Information and Mileage","Revenue and Ridership for June 2023","Fixed Rate for June","Revenue for June","June 10th, 2023","Trip Information for May","Van Mileage for May","Rider Roster for June",0]
["July 2023","June 2023","June 2023 Trip Information and Mileage","Revenue and Ridership for July 2023","Fixed Rate for July","Revenue for July","July 10th, 2023","Trip Information for June","Van Mileage for June","Rider Roster for July",1]
["August 2023","July 2023","July 2023 Trip Information and Mileage","Revenue and Ridership for August 2023","Fixed Rate for August","Revenue for August","August 10th, 2023","Trip Information for July","Van Mileage for July","Rider Roster for August",2]
["September 2023","August 2023","August 2023 Trip Information and Mileage","Revenue and Ridership for September 2023","Fixed Rate for September","Revenue for September","September 10th, 2023","Trip Information for August","Van Mileage for August","Rider Roster for September",3]
["October 2023","September 2023","September 2023 Trip Information and Mileage","Revenue and Ridership for October 2023","Fixed Rate for October","Revenue for October","October 10th, 2023","Trip Information for September","Van Mileage for September","Rider Roster for October",4]
["November 2023","October 2023","October 2023 Trip Information and Mileage","Revenue and Ridership for November 2023","Fixed Rate for November","Revenue for November","November 10th, 2023","Trip Information for October","Van Mileage for October","Rider Roster for November",5]
["December 2023","November 2023","November 2023 Trip Information and Mileage","Revenue and Ridership for December 2023","Fixed Rate for December","Revenue for December","December 10th, 2023","Trip Information for November","Van Mileage for November","Rider Roster for December",6]
["January 2024","December 2023","December 2023 Trip Information and Mileage","Revenue and Ridership for January 2024","Fixed Rate for January","Revenue for January","January 10th, 2024","Trip Information for December","Van Mileage for December","Rider Roster for January",7]
["February 2024","January 2024","January 2024 Trip Information and Mileage","Revenue and Ridership for February 2024","Fixed Rate for February","Revenue for February","February 10th, 2024","Trip Information for January","Van Mileage for January","Rider Roster for February",8]
["March 2024","February 2024","February 2024 Trip Information and Mileage","Revenue and Ridership for March 2024","Fixed Rate for March","Revenue for March","March 10th, 2024","Trip Information for February","Van Mileage for February","Rider Roster for March",9]
["April 2024","March 2024","March 2024 Trip Information and Mileage","Revenue and Ridership for April 2024","Fixed Rate for April","Revenue for April","April 10th, 2024","Trip Information for March","Van Mileage for March","Rider Roster for April",10]
["May 2024","April 2024","April 2024 Trip Information and Mileage","Revenue and Ridership for May 2024","Fixed Rate for May","Revenue for May","May 10th, 2024","Trip Information for April","Van Mileage for April","Rider Roster for May",11]
["June 2024","May 2024","May 2024 Trip Information and Mileage","Revenue and Ridership for June 2024","Fixed Rate for June","Revenue for June","June 10th, 2024","Trip Information for May","Van Mileage for May","Rider Roster for June",12]
["July 2024","June 2024","June 2024 Trip Information and Mileage","Revenue and Ridership for July 2024","Fixed Rate for July","Revenue for July","July 10th, 2024","Trip Information for June","Van Mileage for June","Rider Roster for July",13]
["August 2024","July 2024","July 2024 Trip Information and Mileage","Revenue and Ridership for August 2024","Fixed Rate for August","Revenue for August","August 10th, 2024","Trip Information for July","Van Mileage for July","Rider Roster for August",14]
["September 2024","August 2024","August 2024 Trip Information and Mileage","Revenue and Ridership for September 2024","Fixed Rate for September","Revenue for September","September 10th, 2024","Trip Information for August","Van Mileage for August","Rider Roster for September",15]
["October 2024","September 2024","September 2024 Trip Information and Mileage","Revenue and Ridership for October 2024","Fixed Rate for October","Revenue for October","October 10th, 2024","Trip Information for September","Van Mileage for September","Rider Roster for October",16]
["November 2024","October 2024","October 2024 Trip Information and Mileage","Revenue and Ridership for November 2024","Fixed Rate for November","Revenue for November","November 10th, 2024","Trip Information for October","Van Mileage for October","Rider Roster for November",17]
["December 2024","November 2024","November 2024 Trip Information and Mileage","Revenue and Ridership for December 2024","Fixed Rate for December","Revenue for December","December 10th, 2024","Trip Information for November","Van Mileage for November","Rider Roster for December",18]
["January 2025","December 2024","December 2024 Trip Information and Mileage","Revenue and Ridership for January 2025","Fixed Rate for January","Revenue for January","January 10th, 2025","Trip Information for December","Van Mileage for December","Rider Roster for January",19]
["February 2025","January 2025","January 2025 Trip Information and Mileage","Revenue and Ridership for February 2025","Fixed Rate for February","Revenue for February","February 10th, 2025","Trip Information for January","Van Mileage for January","Rider Roster for February",20]
["March 2025","February 2025","February 2025 Trip Information and Mileage","Revenue and Ridership for March 2025","Fixed Rate for March","Revenue for March","March 10th, 2025","Trip Information for February","Van Mileage for February","Rider Roster for March",21]
["April 2025","March 2025","March 2025 Trip Information and Mileage","Revenue and Ridership for April 2025","Fixed Rate for April","Revenue for April","April 10th, 2025","Trip Information for March","Van Mileage for March","Rider Roster for April",22]
["May 2025","April 2025","April 2025 Trip Information and Mileage","Revenue and Ridership for May 2025","Fixed Rate for May","Revenue for May","May 10th, 2025","Trip Information for April","Van Mileage for April","Rider Roster for May",23]
["June 2025","May 2025","May 2025 Trip Information and Mileage","Revenue and Ridership for June 2025","Fixed Rate for June","Revenue for June","June 10th, 2025","Trip Information for May","Van Mileage for May","Rider Roster for June",24]
["July 2025","June 2025","June 2025 Trip Information and Mileage","Revenue and Ridership for July 2025","Fixed Rate for July","Revenue for July","July 10th, 2025","Trip Information for June","Van Mileage for June","Rider Roster for July",25]
["August 2025","July 2025","July 2025 Trip Information and Mileage","Revenue and Ridership for August 2025","Fixed Rate for August","Revenue for August","August 10th, 2025","Trip Information for July","Van Mileage for July","Rider Roster for August",26]
["September 2025","August 2025","August 2025 Trip Information and Mileage","Revenue and Ridership for September 2025","Fixed Rate for September","Revenue for September","September 10th, 2025","Trip Information for August","Van Mileage for August","Rider Roster for September",27]
["October 2025","September 2025","September 2025 Trip Information and Mileage","Revenue and Ridership for October 2025","Fixed Rate for October","Revenue for October","October 10th, 2025","Trip Information for September","Van Mileage for September","Rider Roster for October",28]
["November 2025","October 2025","October 2025 Trip Information and Mileage","Revenue and Ridership for November 2025","Fixed Rate for November","Revenue for November","November 10th, 2025","Trip Information for October","Van Mileage for October","Rider Roster for November",29]
["December 2025","November 2025","November 2025 Trip Information and Mileage","Revenue and Ridership for December 2025","Fixed Rate for December","Revenue for December","December 10th, 2025","Trip Information for November","Van Mileage for November","Rider Roster for December",30]
["January 2026","December 2025","December 2025 Trip Information and Mileage","Revenue and Ridership for January 2026","Fixed Rate for January","Revenue for January","January 10th, 2026","Trip Information for December","Van Mileage for December","Rider Roster for January",31]

{"sheet":"RTM","index":5,"n_rows":65,"n_cols":5,"rows_kept":65,"cut":false,"hidden":true,"merged":[]}
["RTM for allowable miles"]
["<select>"]
[0]
[5]
[6]
[7]
[8,null,"work week"]
[9,null,"<select>"]
[10,null,"Fold"]
[11,null,"Less than 20 or Vanshare"]
[12,null,20]
[13,null,25]
[14,null,30]
[15,null,35]
[16,null,40]
[17,null,45]
[18,null,50]
[19,null,55,null,"rtm"]
[20,null,60,null,"van size"]
[25,null,65,null,"schedule"]
[30,null,70]
[35,null,75]
[40,null,80]
[45,null,85]
[50,null,90]
[55,null,95]
[60,null,100]
[65,null,105]
[70,null,110]
[75,null,115]
[80,null,120]
[85,null,125]
[90,null,130]
[95,null,135]
[100,null,140]
[105,null,145]
[110,null,150]
[115,null,155]
[120,null,160]
[125,null,165]
{"$rows_left_out":26}
{"sheet":"Fare Schedule","index":6,"n_rows":716,"n_cols":32,"rows_kept":716,"cut":false,"hidden":true,"merged":[]}
[]
["RTM","Schedule","Van Type","Fare","Daily Rate",null,"Schedule",null,"Van Type",null,"fare or new start"]
["Less than 20 or Vanshare","3-Day","7-Passenger",200,"n/a",null,"<select>",null,"<select>",null,{"$f":"'Monthly Report'!E28","v":0}]
[20,"3-Day","7-Passenger",418,32.15,null,"3-Day",null,"7-Passenger",null,{"$f":"'Fare Calculator'!#REF!","v":{"$error":"#REF!"}}]
[25,"3-Day","7-Passenger",448,34.46,null,"4-Day",null,"12/15-Passenger"]
[30,"3-Day","7-Passenger",478,36.770000000000003,null,"5-Day",null,"Leaf"]
[35,"3-Day","7-Passenger",507,39,null,"6-Day"]
[40,"3-Day","7-Passenger",537,41.31,null,"7-Day",null,null,null,null,null,null,"work week","3-day","4-day","5-day","6-day","7-day","9-80","3-day2","4-day3","5-day4","6-day5","7-day6","9-807","3-day8","4-day9","5-day10","6-day11","7-day12","9-8013"]
[45,"3-Day","7-Passenger",566,43.54,null,"9-80",null,null,null,null,null,null,"RTM","7-passenger","7-passenger","7-passenger","7-passenger","7-passenger","7-passenger","12/15-passenger","12/15-passenger","12/15-passenger","12/15-passenger","12/15-passenger","12/15-passenger","Leaf","Leaf","Leaf","Leaf","Leaf","Leaf"]
[50,"3-Day","7-Passenger",596,45.85,null,null,null,null,null,null,null,null,"Less than 20",200,200,200,200,200,200,200,200,200,200,200,200,200,200,200,200,200,200]
[55,"3-Day","7-Passenger",626,48.15,null,null,null,null,null,null,null,null,20,418,455,491,537,573,473,533,574,614,666,706,594,418,440,463,491,513,452]
[60,"3-Day","7-Passenger",655,50.38,null,null,null,null,null,null,null,null,25,448,494,539,596,641,516,566,617,668,732,783,643,436,464,492,527,555,478]
[65,"3-Day","7-Passenger",685,52.69,null,null,null,null,null,null,null,null,30,478,532,587,655,710,560,599,660,722,798,860,691,454,488,522,564,597,505]
[70,"3-Day","7-Passenger",714,54.92,null,null,null,null,null,null,null,null,35,507,571,635,714,778,603,632,704,775,865,936,740,473,512,551,600,639,531]
[75,"3-Day","7-Passenger",744,57.23,null,null,null,null,null,null,null,null,40,537,610,682,774,846,646,666,747,829,931,1013,788,491,536,580,637,681,558]
[80,"3-Day","7-Passenger",774,59.54,null,null,null,null,null,null,null,null,45,566,648,730,833,915,689,699,791,883,997,1089,837,509,559,610,673,723,585]
[85,"3-Day","7-Passenger",803,61.77,null,null,null,null,null,null,null,null,50,596,687,778,892,983,733,732,834,936,1064,1166,885,527,583,639,709,765,611]
[90,"3-Day","7-Passenger",833,64.08,null,null,null,null,null,null,null,null,55,626,726,826,951,1051,776,765,877,990,1130,1243,934,545,607,669,746,807,638]
[95,"3-Day","7-Passenger",862,66.31,null,null,null,null,null,null,null,null,60,655,764,874,1010,1120,819,798,921,1043,1197,1319,982,564,631,698,782,850,665]
[100,"3-Day","7-Passenger",892,68.62,null,null,null,null,null,null,null,null,65,685,803,922,1070,1188,862,832,964,1097,1263,1396,1031,582,655,728,819,892,691]
[105,"3-Day","7-Passenger",922,70.92,null,null,null,null,null,null,null,null,70,714,842,969,1129,1256,906,865,1008,1151,1329,1472,1079,600,679,757,855,934,718]
[110,"3-Day","7-Passenger",951,73.150000000000006,null,null,null,null,null,null,null,null,75,744,881,1017,1188,1324,949,898,1051,1204,1396,1549,1128,618,702,786,892,976,744]
[115,"3-Day","7-Passenger",981,75.459999999999994,null,null,null,null,null,null,null,null,80,774,919,1065,1247,1393,992,931,1095,1258,1462,1626,1176,"n/a","n/a","n/a","n/a","n/a","n/a"]
[120,"3-Day","7-Passenger",1010,77.69,null,null,null,null,null,null,null,null,85,803,958,1113,1306,1461,1035,964,1138,1312,1529,1702,1225,"n/a","n/a","n/a","n/a","n/a","n/a"]
[125,"3-Day","7-Passenger",1040,80,null,null,null,null,null,null,null,null,90,833,997,1161,1365,1529,1079,997,1181,1365,1595,1779,1273,"n/a","n/a","n/a","n/a","n/a","n/a"]
[130,"3-Day","7-Passenger",1070,82.31,null,null,null,null,null,null,null,null,95,862,1035,1208,1425,1598,1122,1031,1225,1419,1661,1855,1322,"n/a","n/a","n/a","n/a","n/a","n/a"]
[135,"3-Day","7-Passenger",1099,84.54,null,null,null,null,null,null,null,null,100,892,1074,1256,1484,1666,1165,1064,1268,1472,1728,1932,1370,"n/a","n/a","n/a","n/a","n/a","n/a"]
[140,"3-Day","7-Passenger",1129,86.85,null,null,null,null,null,null,null,null,105,922,1113,1304,1543,1734,1208,1097,1312,1526,1794,2009,1419,"n/a","n/a","n/a","n/a","n/a","n/a"]
[145,"3-Day","7-Passenger",1158,89.08,null,null,null,null,null,null,null,null,110,951,1151,1352,1602,1803,1252,1130,1355,1580,1861,2085,1467,"n/a","n/a","n/a","n/a","n/a","n/a"]
[150,"3-Day","7-Passenger",1188,91.38,null,null,null,null,null,null,null,null,115,981,1190,1400,1661,1871,1295,1163,1398,1633,1927,2162,1516,"n/a","n/a","n/a","n/a","n/a","n/a"]
["Less than 20 or Vanshare","4-Day","7-Passenger",200,"n/a",null,null,null,null,null,null,null,null,120,1010,1229,1447,1721,1939,1338,1197,1442,1687,1993,2238,1564,"n/a","n/a","n/a","n/a","n/a","n/a"]
[20,"4-Day","7-Passenger",455,26.76,null,null,null,null,null,null,null,null,125,1040,1268,1495,1780,2007,1381,1230,1485,1741,2060,2315,1613,"n/a","n/a","n/a","n/a","n/a","n/a"]
[25,"4-Day","7-Passenger",494,29.06,null,null,null,null,null,null,null,null,130,1070,1306,1543,1839,2076,1425,1263,1529,1794,2126,2392,1661,"n/a","n/a","n/a","n/a","n/a","n/a"]
[30,"4-Day","7-Passenger",532,31.29,null,null,null,null,null,null,null,null,135,1099,1345,1591,1898,2144,1468,1296,1572,1848,2192,2468,1710,"n/a","n/a","n/a","n/a","n/a","n/a"]
[35,"4-Day","7-Passenger",571,33.590000000000003,null,null,null,null,null,null,null,null,140,1129,1384,1639,1957,2212,1511,1329,1615,1901,2259,2545,1758,"n/a","n/a","n/a","n/a","n/a","n/a"]
[40,"4-Day","7-Passenger",610,35.880000000000003,null,null,null,null,null,null,null,null,145,1158,1422,1686,2017,2281,1554,1363,1659,1955,2325,2621,1807,"n/a","n/a","n/a","n/a","n/a","n/a"]
[45,"4-Day","7-Passenger",648,38.119999999999997,null,null,null,null,null,null,null,null,150,1188,1461,1734,2076,2349,1598,1396,1702,2009,2392,2698,1855,"n/a","n/a","n/a","n/a","n/a","n/a"]
[50,"4-Day","7-Passenger",687,40.409999999999997]
[55,"4-Day","7-Passenger",726,42.71]
[60,"4-Day","7-Passenger",764,44.94]
{"$rows_left_out":676}